Build summary for Teem starting at Thursday, December 08 2022 22:00:00

Group:

Errors:

teem-SVN-Linux-3.10.0-123.el7.x86_64-x86_64: CMake Error at CMakeLists.txt:26 (cmake_minimum_required):
teem-SVN-Linux-3.10.0-123.el7.x86_64-x86_64: /usr/bin/ar: CMakeFiles/teem.dir/src/unrrdu/env.c.o: No such file or directory
teem-SVN-Linux-3.10.0-123.el7.x86_64-x86_64: gmake[2]: *** No rule to make target `bin/libteem.a', needed by `bin/gprobe'. Stop.
teem-SVN-Linux-3.10.0-123.el7.x86_64-x86_64: gmake[2]: *** No rule to make target `bin/libteem.a', needed by `bin/tend'. Stop.
teem-SVN-Linux-3.10.0-123.el7.x86_64-x86_64: gmake[2]: *** No rule to make target `bin/libteem.a', needed by `bin/miter'. Stop.
teem-SVN-Linux-3.10.0-123.el7.x86_64-x86_64: gmake[2]: *** No rule to make target `bin/libteem.a', needed by `bin/unu'. Stop.
teem-SVN-Linux-3.10.0-123.el7.x86_64-x86_64: gmake[2]: *** No rule to make target `bin/libteem.a', needed by `bin/puller'. Stop.
teem-SVN-Linux-3.10.0-123.el7.x86_64-x86_64: gmake[2]: *** No rule to make target `bin/libteem.a', needed by `bin/pprobe'. Stop.
teem-SVN-Linux-3.10.0-123.el7.x86_64-x86_64: gmake[2]: *** No rule to make target `bin/libteem.a', needed by `bin/ilk'. Stop.
teem-SVN-Linux-3.10.0-123.el7.x86_64-x86_64: gmake[2]: *** No rule to make target `bin/libteem.a', needed by `bin/mrender'. Stop.
teem-SVN-Linux-3.10.0-123.el7.x86_64-x86_64: gmake[2]: *** No rule to make target `bin/libteem.a', needed by `bin/overrgb'. Stop.
teem-SVN-Linux-3.10.0-123.el7.x86_64-x86_64: gmake[2]: *** No rule to make target `bin/libteem.a', needed by `bin/spots'. Stop.
teem-SVN-Linux-3.10.0-123.el7.x86_64-x86_64: gmake[2]: *** No rule to make target `bin/libteem.a', needed by `bin/vprobe'. Stop.
teem-SVN-Linux-3.10.0-123.el7.x86_64-x86_64: gmake[2]: *** No rule to make target `bin/libteem.a', needed by `bin/qbert'. Stop.
teem-SVN-Linux-3.10.0-123.el7.x86_64-x86_64: gmake[2]: *** No rule to make target `bin/libteem.a', needed by `bin/airSanity'. Stop.
teem-SVN-Linux-3.10.0-123.el7.x86_64-x86_64: gmake[2]: *** No rule to make target `bin/libteem.a', needed by `bin/cubic'. Stop.
teem-SVN-Linux-3.10.0-123.el7.x86_64-x86_64: gmake[2]: *** No rule to make target `bin/libteem.a', needed by `bin/ninspect'. Stop.
teem-SVN-Linux-3.10.0-123.el7.x86_64-x86_64: gmake[2]: *** No rule to make target `bin/libteem.a', needed by `bin/nrrdSanity'. Stop.
teem-SVN-Linux-3.10.0-123.el7.x86_64-x86_64: gmake[2]: *** No rule to make target `bin/libteem.a', needed by `bin/talkweb'. Stop.
teem-SVN-Linux-3.10.0-123.el7.x86_64-x86_64: gmake[2]: *** No rule to make target `bin/libteem.a', needed by `bin/ungantry'. Stop.
teem-SVN-Linux-3.10.0-123.el7.x86_64-x86_64: gmake[2]: *** No rule to make target `bin/libteem.a', needed by `bin/deconv'. Stop.
teem-SVN-Linux-3.10.0-123.el7.x86_64-x86_64: gmake[2]: *** No rule to make target `bin/libteem.a', needed by `bin/gkms'. Stop.
teem-SVN-Linux-3.10.0-123.el7.x86_64-x86_64: gmake[2]: *** No rule to make target `bin/libteem.a', needed by `bin/emap'. Stop.
teem-SVN-Linux-3.10.0-123.el7.x86_64-x86_64: gmake[2]: *** No rule to make target `bin/libteem.a', needed by `bin/test_string'. Stop.
teem-SVN-Linux-3.10.0-123.el7.x86_64-x86_64: gmake[2]: *** No rule to make target `bin/libteem.a', needed by `bin/test_amath'. Stop.
teem-SVN-Linux-3.10.0-123.el7.x86_64-x86_64: gmake[2]: *** No rule to make target `bin/libteem.a', needed by `bin/test_mtrand'. Stop.
teem-SVN-Linux-3.10.0-123.el7.x86_64-x86_64: gmake[2]: *** No rule to make target `bin/libteem.a', needed by `bin/test_miscAir'. Stop.
teem-SVN-Linux-3.10.0-123.el7.x86_64-x86_64: gmake[2]: *** No rule to make target `bin/libteem.a', needed by `bin/test_strtok'. Stop.
teem-SVN-Linux-3.10.0-123.el7.x86_64-x86_64: gmake[2]: *** No rule to make target `bin/libteem.a', needed by `bin/test_pptest'. Stop.
teem-SVN-Linux-3.10.0-123.el7.x86_64-x86_64: gmake[2]: *** No rule to make target `bin/libteem.a', needed by `bin/test_biff'. Stop.
teem-SVN-Linux-3.10.0-123.el7.x86_64-x86_64: gmake[2]: *** No rule to make target `bin/libteem.a', needed by `bin/test_sanity'. Stop.
teem-SVN-Linux-3.10.0-123.el7.x86_64-x86_64: gmake[2]: *** No rule to make target `bin/libteem.a', needed by `bin/test_trand'. Stop.
teem-SVN-Linux-3.10.0-123.el7.x86_64-x86_64: gmake[2]: *** No rule to make target `bin/libteem.a', needed by `bin/test_tskip'. Stop.
teem-SVN-Linux-3.10.0-123.el7.x86_64-x86_64: gmake[2]: *** No rule to make target `bin/libteem.a', needed by `bin/test_macros'. Stop.
teem-SVN-Linux-3.10.0-123.el7.x86_64-x86_64: gmake[2]: *** No rule to make target `bin/libteem.a', needed by `bin/test_bspec'. Stop.
teem-SVN-Linux-3.10.0-123.el7.x86_64-x86_64: gmake[2]: *** No rule to make target `bin/libteem.a', needed by `bin/test_tload'. Stop.
teem-SVN-Linux-3.10.0-123.el7.x86_64-x86_64: gmake[2]: *** No rule to make target `bin/libteem.a', needed by `bin/test_unulist'. Stop.
teem-SVN-Linux-3.10.0-123.el7.x86_64-x86_64: gmake[2]: *** No rule to make target `bin/libteem.a', needed by `bin/test_probeMulti'. Stop.
teem-SVN-Linux-3.10.0-123.el7.x86_64-x86_64: gmake[2]: *** No rule to make target `bin/libteem.a', needed by `bin/test_sbp'. Stop.
teem-SVN-Linux-3.10.0-123.el7.x86_64-x86_64: gmake[2]: *** No rule to make target `bin/libteem.a', needed by `bin/test_probeScl'. Stop.
teem-SVN-Linux-3.10.0-123.el7.x86_64-x86_64: gmake[2]: *** No rule to make target `bin/libteem.a', needed by `bin/test_probePolynomial'. Stop.
teem-SVN-Linux-3.10.0-123.el7.x86_64-x86_64: gmake[2]: *** No rule to make target `bin/libteem.a', needed by `bin/test_tendlist'. Stop.
teem-SVN-Linux-3.10.0-123.el7.x86_64-x86_64: gmake[2]: *** No rule to make target `bin/libteem.a', needed by `bin/test_glyphBqd'. Stop.
teem-SVN-Linux-3.10.0-123.el7.x86_64-x86_64: gmake[2]: *** No rule to make target `bin/libteem.a', needed by `bin/test_probeSS'. Stop.
teem-SVN-Linux-3.10.0-123.el7.x86_64-x86_64: gmake[2]: *** No rule to make target `bin/libteem.a', needed by `bin/test_kernall'. Stop.
teem-SVN-Linux-3.10.0-123.el7.x86_64-x86_64: gmake[2]: *** No rule to make target `bin/libteem.a', needed by `bin/test_buildinfo'. Stop.
teem-SVN-Linux-3.10.0-123.el7.x86_64-x86_64: gmake[2]: *** No rule to make target `bin/libteem.a', needed by `bin/test_enmall'. Stop.
teem-SVN-Linux-3.10.0-123.8.1.el7.x86_64-x86_64: CMake Error at CMakeLists.txt:26 (cmake_minimum_required):
teem-SVN-Linux-3.10.0-123.8.1.el7.x86_64-x86_64: /usr/bin/ar: CMakeFiles/teem.dir/src/unrrdu/env.c.o: No such file or directory
teem-SVN-Linux-3.10.0-123.8.1.el7.x86_64-x86_64: gmake[2]: *** No rule to make target `bin/libteem.a', needed by `bin/gprobe'. Stop.
teem-SVN-Linux-3.10.0-123.8.1.el7.x86_64-x86_64: gmake[2]: *** No rule to make target `bin/libteem.a', needed by `bin/tend'. Stop.
teem-SVN-Linux-3.10.0-123.8.1.el7.x86_64-x86_64: gmake[2]: *** No rule to make target `bin/libteem.a', needed by `bin/miter'. Stop.
teem-SVN-Linux-3.10.0-123.8.1.el7.x86_64-x86_64: gmake[2]: *** No rule to make target `bin/libteem.a', needed by `bin/unu'. Stop.
teem-SVN-Linux-3.10.0-123.8.1.el7.x86_64-x86_64: gmake[2]: *** No rule to make target `bin/libteem.a', needed by `bin/puller'. Stop.
teem-SVN-Linux-3.10.0-123.8.1.el7.x86_64-x86_64: gmake[2]: *** No rule to make target `bin/libteem.a', needed by `bin/pprobe'. Stop.
teem-SVN-Linux-3.10.0-123.8.1.el7.x86_64-x86_64: gmake[2]: *** No rule to make target `bin/libteem.a', needed by `bin/ilk'. Stop.
teem-SVN-Linux-3.10.0-123.8.1.el7.x86_64-x86_64: gmake[2]: *** No rule to make target `bin/libteem.a', needed by `bin/mrender'. Stop.
teem-SVN-Linux-3.10.0-123.8.1.el7.x86_64-x86_64: gmake[2]: *** No rule to make target `bin/libteem.a', needed by `bin/overrgb'. Stop.
teem-SVN-Linux-3.10.0-123.8.1.el7.x86_64-x86_64: gmake[2]: *** No rule to make target `bin/libteem.a', needed by `bin/spots'. Stop.
teem-SVN-Linux-3.10.0-123.8.1.el7.x86_64-x86_64: gmake[2]: *** No rule to make target `bin/libteem.a', needed by `bin/vprobe'. Stop.
teem-SVN-Linux-3.10.0-123.8.1.el7.x86_64-x86_64: gmake[2]: *** No rule to make target `bin/libteem.a', needed by `bin/qbert'. Stop.
teem-SVN-Linux-3.10.0-123.8.1.el7.x86_64-x86_64: gmake[2]: *** No rule to make target `bin/libteem.a', needed by `bin/airSanity'. Stop.
teem-SVN-Linux-3.10.0-123.8.1.el7.x86_64-x86_64: gmake[2]: *** No rule to make target `bin/libteem.a', needed by `bin/cubic'. Stop.
teem-SVN-Linux-3.10.0-123.8.1.el7.x86_64-x86_64: gmake[2]: *** No rule to make target `bin/libteem.a', needed by `bin/ninspect'. Stop.
teem-SVN-Linux-3.10.0-123.8.1.el7.x86_64-x86_64: gmake[2]: *** No rule to make target `bin/libteem.a', needed by `bin/nrrdSanity'. Stop.
teem-SVN-Linux-3.10.0-123.8.1.el7.x86_64-x86_64: gmake[2]: *** No rule to make target `bin/libteem.a', needed by `bin/talkweb'. Stop.
teem-SVN-Linux-3.10.0-123.8.1.el7.x86_64-x86_64: gmake[2]: *** No rule to make target `bin/libteem.a', needed by `bin/ungantry'. Stop.
teem-SVN-Linux-3.10.0-123.8.1.el7.x86_64-x86_64: gmake[2]: *** No rule to make target `bin/libteem.a', needed by `bin/deconv'. Stop.
teem-SVN-Linux-3.10.0-123.8.1.el7.x86_64-x86_64: gmake[2]: *** No rule to make target `bin/libteem.a', needed by `bin/gkms'. Stop.
teem-SVN-Linux-3.10.0-123.8.1.el7.x86_64-x86_64: gmake[2]: *** No rule to make target `bin/libteem.a', needed by `bin/emap'. Stop.
teem-SVN-Linux-3.10.0-123.8.1.el7.x86_64-x86_64: gmake[2]: *** No rule to make target `bin/libteem.a', needed by `bin/test_string'. Stop.
teem-SVN-Linux-3.10.0-123.8.1.el7.x86_64-x86_64: gmake[2]: *** No rule to make target `bin/libteem.a', needed by `bin/test_amath'. Stop.
teem-SVN-Linux-3.10.0-123.8.1.el7.x86_64-x86_64: gmake[2]: *** No rule to make target `bin/libteem.a', needed by `bin/test_mtrand'. Stop.
teem-SVN-Linux-3.10.0-123.8.1.el7.x86_64-x86_64: gmake[2]: *** No rule to make target `bin/libteem.a', needed by `bin/test_miscAir'. Stop.
teem-SVN-Linux-3.10.0-123.8.1.el7.x86_64-x86_64: gmake[2]: *** No rule to make target `bin/libteem.a', needed by `bin/test_strtok'. Stop.
teem-SVN-Linux-3.10.0-123.8.1.el7.x86_64-x86_64: gmake[2]: *** No rule to make target `bin/libteem.a', needed by `bin/test_pptest'. Stop.
teem-SVN-Linux-3.10.0-123.8.1.el7.x86_64-x86_64: gmake[2]: *** No rule to make target `bin/libteem.a', needed by `bin/test_biff'. Stop.
teem-SVN-Linux-3.10.0-123.8.1.el7.x86_64-x86_64: gmake[2]: *** No rule to make target `bin/libteem.a', needed by `bin/test_sanity'. Stop.
teem-SVN-Linux-3.10.0-123.8.1.el7.x86_64-x86_64: gmake[2]: *** No rule to make target `bin/libteem.a', needed by `bin/test_trand'. Stop.
teem-SVN-Linux-3.10.0-123.8.1.el7.x86_64-x86_64: gmake[2]: *** No rule to make target `bin/libteem.a', needed by `bin/test_tskip'. Stop.
teem-SVN-Linux-3.10.0-123.8.1.el7.x86_64-x86_64: gmake[2]: *** No rule to make target `bin/libteem.a', needed by `bin/test_macros'. Stop.
teem-SVN-Linux-3.10.0-123.8.1.el7.x86_64-x86_64: gmake[2]: *** No rule to make target `bin/libteem.a', needed by `bin/test_bspec'. Stop.
teem-SVN-Linux-3.10.0-123.8.1.el7.x86_64-x86_64: gmake[2]: *** No rule to make target `bin/libteem.a', needed by `bin/test_tload'. Stop.
teem-SVN-Linux-3.10.0-123.8.1.el7.x86_64-x86_64: gmake[2]: *** No rule to make target `bin/libteem.a', needed by `bin/test_unulist'. Stop.
teem-SVN-Linux-3.10.0-123.8.1.el7.x86_64-x86_64: gmake[2]: *** No rule to make target `bin/libteem.a', needed by `bin/test_probeMulti'. Stop.
teem-SVN-Linux-3.10.0-123.8.1.el7.x86_64-x86_64: gmake[2]: *** No rule to make target `bin/libteem.a', needed by `bin/test_sbp'. Stop.
teem-SVN-Linux-3.10.0-123.8.1.el7.x86_64-x86_64: gmake[2]: *** No rule to make target `bin/libteem.a', needed by `bin/test_probeScl'. Stop.
teem-SVN-Linux-3.10.0-123.8.1.el7.x86_64-x86_64: gmake[2]: *** No rule to make target `bin/libteem.a', needed by `bin/test_probePolynomial'. Stop.
teem-SVN-Linux-3.10.0-123.8.1.el7.x86_64-x86_64: gmake[2]: *** No rule to make target `bin/libteem.a', needed by `bin/test_tendlist'. Stop.
teem-SVN-Linux-3.10.0-123.8.1.el7.x86_64-x86_64: gmake[2]: *** No rule to make target `bin/libteem.a', needed by `bin/test_glyphBqd'. Stop.
teem-SVN-Linux-3.10.0-123.8.1.el7.x86_64-x86_64: gmake[2]: *** No rule to make target `bin/libteem.a', needed by `bin/test_probeSS'. Stop.
teem-SVN-Linux-3.10.0-123.8.1.el7.x86_64-x86_64: gmake[2]: *** No rule to make target `bin/libteem.a', needed by `bin/test_kernall'. Stop.
teem-SVN-Linux-3.10.0-123.8.1.el7.x86_64-x86_64: gmake[2]: *** No rule to make target `bin/libteem.a', needed by `bin/test_buildinfo'. Stop.
teem-SVN-Linux-3.10.0-123.8.1.el7.x86_64-x86_64: gmake[2]: *** No rule to make target `bin/libteem.a', needed by `bin/test_enmall'. Stop.

src/unrrdu/env.c

Errors:

teem-SVN-Linux-3.10.0-123.el7.x86_64-x86_64: /.../teem-SVN/src/unrrdu/env.c:291:19: error: ‘nrrdEnvVarDefaultWriteMoreThanFloatInText’ undeclared (first use in this function)
teem-SVN-Linux-3.10.0-123.8.1.el7.x86_64-x86_64: /.../teem-SVN/src/unrrdu/env.c:291:19: error: ‘nrrdEnvVarDefaultWriteMoreThanFloatInText’ undeclared (first use in this function)
teem-SVN-Linux-3.10.0-123.el7.x86_64-x86_64: /.../teem-SVN/src/unrrdu/env.c:292:19: error: ‘nrrdDefaultWriteMoreThanFloatInText’ undeclared (first use in this function)
teem-SVN-Linux-3.10.0-123.8.1.el7.x86_64-x86_64: /.../teem-SVN/src/unrrdu/env.c:292:19: error: ‘nrrdDefaultWriteMoreThanFloatInText’ undeclared (first use in this function)

Warnings:

teem-SVN-Linux-3.10.0-123.el7.x86_64-x86_64: /.../teem-SVN/src/unrrdu/env.c:291:19: note: each undeclared identifier is reported only once for each function it appears in
teem-SVN-Linux-3.10.0-123.8.1.el7.x86_64-x86_64: /.../teem-SVN/src/unrrdu/env.c:291:19: note: each undeclared identifier is reported only once for each function it appears in